Errors with Planet Venus on DreamHost

Dr. Awab Alvi drawab at gmail.com
Wed Jan 16 08:28:44 EST 2008


I don't know if you have received some help in the mean time - but if its
any help -

I run Venus on Dreamhost on http://bloggers.pk - I can only assume that you
get the error since you need to specifically  use Python 2.4 to run Venus  -
using the following cron job (replace the CAPS with your own data)

cd /home/DREAMHOSTUSERNAME/DOMAINDIRECTORY/venus; python2.4 planet.py
config.ini

Cheers

Awab Alvi
http://teeth.com.pk/blog


On Jan 10, 2008 4:54 PM, Asbjørn Ulsberg <asbjorn at ulsberg.no> wrote:

> I've just run "python runtests.py" on my DreamHost account, yielding the
> following results:
>
> Genshi is not available => can't test genshi filters
> xsltproc is not available => can't test XSLT templates
> libxslt is not available => can't test xslt filters
> Popen is not available => can't test standard filters
> Redland RDF is not available => can't test FOAF reading lists
> Django is not available => can't test django filters
>
> ........................................................................E.............................................................................................................FFFF..
> ======================================================================
> ERROR: test_spiderFeed_retroactive_filter (tests.test_spider.SpiderTest)
> ----------------------------------------------------------------------
> Traceback (most recent call last):
>  File "~/planet/tests/test_spider.py", line 82, in
> test_spiderFeed_retroactive_filter
>    self.spiderFeed(testfeed % '1b')
>  File "~/planet/tests/test_spider.py", line 50, in spiderFeed
>    writeCache(feed_uri, feed_info, data)
>  File "~/planet/planet/spider.py", line 217, in writeCache
>    output = shell.run(filter, output, mode="filter")
>  File "~/planet/planet/shell/__init__.py", line 62, in run
>    return module.run(template_resolved, doc, None, options)
> AttributeError: 'module' object has no attribute 'run'
>
> ======================================================================
> FAIL: test_feeds (tests.test_config_csv.ConfigCsvTest)
> ----------------------------------------------------------------------
> Traceback (most recent call last):
>  File "~/planet/tests/test_config_csv.py", line 21, in test_feeds
>    self.assertEqual(['feed1', 'feed2'], feeds)
>  File "/usr/lib/python2.3/unittest.py", line 302, in failUnlessEqual
>    raise self.failureException, \
> AssertionError: ['feed1', 'feed2'] != []
>
> ======================================================================
> FAIL: test_filters (tests.test_config_csv.ConfigCsvTest)
> ----------------------------------------------------------------------
> Traceback (most recent call last):
>  File "~/planet/tests/test_config_csv.py", line 24, in test_filters
>    self.assertEqual(['foo','bar'], config.filters('feed2'))
>  File "/usr/lib/python2.3/unittest.py", line 302, in failUnlessEqual
>    raise self.failureException, \
> AssertionError: ['foo', 'bar'] != ['foo']
>
> ======================================================================
> FAIL: test_feeds (tests.test_config_csv.ConfigCsvTest)
> ----------------------------------------------------------------------
> Traceback (most recent call last):
>  File "~/planet/tests/test_config_csv.py", line 21, in test_feeds
>    self.assertEqual(['feed1', 'feed2'], feeds)
>  File "/usr/lib/python2.3/unittest.py", line 302, in failUnlessEqual
>    raise self.failureException, \
> AssertionError: ['feed1', 'feed2'] != []
>
> ======================================================================
> FAIL: test_filters (tests.test_config_csv.ConfigCsvTest)
> ----------------------------------------------------------------------
> Traceback (most recent call last):
>  File "~/planet/tests/test_config_csv.py", line 24, in test_filters
>    self.assertEqual(['foo','bar'], config.filters('feed2'))
>  File "/usr/lib/python2.3/unittest.py", line 302, in failUnlessEqual
>    raise self.failureException, \
> AssertionError: ['foo', 'bar'] != ['foo']
>
> ----------------------------------------------------------------------
> Ran 188 tests in 9.875s
>
> FAILED (failures=4, errors=1)
>
> The documentation tells me to stop here and contact the mailing list if
> something errs, so here I am. Help anyone? :-)
>
>
> --
> Asbjørn Ulsberg           -=|=-        asbjorn at ulsberg.no
> «He's a loathsome offensive brute, yet I can't look away»
>
> --
> devel mailing list
> devel at lists.planetplanet.org
> http://lists.planetplanet.org/mailman/listinfo/devel
>
-------------- next part --------------
An HTML attachment was scrubbed...
URL: /archives/devel/attachments/20080116/54e15ee8/attachment.htm 


More information about the devel mailing list